Target
Epidermal growth factor receptor
Ligand
BDBM497327
Substrate
Meas. Tech.
TBD
IC50
15070±3100 nM
Citation
 Gangjee, A Pyrimidine compounds and pyrimido indole compounds and methods of use US Patent  US11001595 Publication Date 5/11/2021 
Target
Name:
Epidermal growth factor receptor
Synonyms:
EGF Receptor Substrate EGFR_HUMAN ERBB1 Epidermal Growth Factor Receptor erbB-1 Epidermal growth factor receptor (EGFR) HER1 Proto-oncogene c-ErbB-1 Tyrosine-Protein Kinase ErbB-1
Type:
Receptor Kinase Domain
Mol. Mass.:
134279.59
Organism:
Homo sapiens (Human)
Description:
P00533
Residue:
1210
  
Inhibitor
Name:
BDBM497327
Synonyms:
US11001595, Compound 1 US11111252, Compound 1
Type:
Small organic molecule
Emp. Form.:
C15H16N4O2S2
Mol. Mass.:
348.443
SMILES:
COc1ccc(Sc2sc3nc(N)nc(N)c3c2C)cc1OC
: