Target
Vascular endothelial growth factor receptor 2
Ligand
BDBM497327
Substrate
Meas. Tech.
TBD
IC50
22600±4500 nM
Citation
 Gangjee, A Pyrimidine compounds and pyrimido indole compounds and methods of use US Patent  US11001595 Publication Date 5/11/2021 
Target
Name:
Vascular endothelial growth factor receptor 2
Synonyms:
CD_antigen=CD309 Fetal liver kinase 1 (FLK-1) KDR Protein-tyrosine kinase receptor Flk-1 VEGFR-2 VEGFR2 Vascular Endothelial Growth Factor Receptor Kinase 2 Vascular endothelial growth factor receptor 2 (KDR) Vascular endothelial growth factor receptor 2 (VEGFR2) Vascular endothelial growth factor receptor-2 (VEGFR-2)
Type:
Receptor Tyrosine Kinase
Mol. Mass.:
151510.97
Organism:
Homo sapiens (Human)
Description:
P35968
Residue:
1356
  
Inhibitor
Name:
BDBM497327
Synonyms:
US11001595, Compound 1 US11111252, Compound 1
Type:
Small organic molecule
Emp. Form.:
C15H16N4O2S2
Mol. Mass.:
348.443
SMILES:
COc1ccc(Sc2sc3nc(N)nc(N)c3c2C)cc1OC
: