Target
Vascular endothelial growth factor receptor 1
Ligand
BDBM497328
Substrate
Meas. Tech.
TBD
IC50
160100±28900 nM
Citation
 Gangjee, A Pyrimidine compounds and pyrimido indole compounds and methods of use US Patent  US11001595 Publication Date 5/11/2021 
Target
Name:
Vascular endothelial growth factor receptor 1
Synonyms:
FLT FRT Fms-like tyrosine kinase 1 Tyrosine-protein kinase FRT VEGFR-1 VGFR1_HUMAN Vascular endothelial growth factor receptor 1 (FLT1) Vascular endothelial growth factor receptor 1 and 2 (Flt-1 and KDR) Vascular permeability factor receptor vascular endothelial growth factor/vascular permeability factor receptor
Type:
Receptor Tyrosine Kinase
Mol. Mass.:
150800.23
Organism:
Homo sapiens (Human)
Description:
P17948
Residue:
1338
  
Inhibitor
Name:
BDBM497328
Synonyms:
US11001595, Compound 2
Type:
Small organic molecule
Emp. Form.:
C14H14N4OS2
Mol. Mass.:
318.417
SMILES:
COc1ccccc1Sc1sc2nc(N)nc(N)c2c1C
: