Target
Isocitrate dehydrogenase [NADP] cytoplasmic [R132H]
Ligand
BDBM497343
Substrate
Meas. Tech.
Biochemical Assay
IC50
2.76±n/a nM
Citation
 Bauer, RABoulet, SLBurkholder, TPHahn, PJRankovic, Z 7-phenylethylamino-4H-pyrimido[4,5-d][1,3]oxazin-2-one compounds as mutant IDH1 and IDH2 inhibitors US Patent  US11001596 Publication Date 5/11/2021 
Target
Name:
Isocitrate dehydrogenase [NADP] cytoplasmic [R132H]
Synonyms:
Cytosolic NADP-isocitrate dehydrogenase (IDH1)(R132H) IDH1 R132H IDHC_HUMAN Isocitrate dehydrogenase 1 mutant (R132H) Isocitrate dehydrogenase [NADP] cytoplasmic (IDH1)(R132H) PICD
Type:
Protein
Mol. Mass.:
46641.74
Organism:
Homo sapiens (Human)
Description:
Human IDH1 R132H (SEQ ID No. 2 in patent). First three are removed. Google patent parsed wrong.
Residue:
414
  
Inhibitor
Name:
BDBM497343
Synonyms:
7-[[(1S)-1-[4-[2- Cyclopropyl-1-(4-prop-2- enoylpiperazin-1- yl)ethyl]phenyl]ethyl]amino]- 1-ethyl-4H-pyrimido[4,5- d][1,3]oxazin-2-one US11629156, Example 5 | US11649247, Example 5
Type:
Small organic molecule
Emp. Form.:
C28H36N6O3
Mol. Mass.:
504.6238
SMILES:
CCN1C(=O)OCc2cnc(N[C@@H](C)c3ccc(cc3)C(CC3CC3)N3CCN(CC3)C(=O)C=C)nc12
: