Target
Isocitrate dehydrogenase [NADP], mitochondrial [R140Q]
Ligand
BDBM497348
Substrate
Meas. Tech.
Biochemical Assay
IC50
74.3±n/a nM
Citation
 Bauer, RABoulet, SLBurkholder, TPHahn, PJRankovic, Z 7-phenylethylamino-4H-pyrimido[4,5-d][1,3]oxazin-2-one compounds as mutant IDH1 and IDH2 inhibitors US Patent  US11001596 Publication Date 5/11/2021 
Target
Name:
Isocitrate dehydrogenase [NADP], mitochondrial [R140Q]
Synonyms:
IDH2 IDHP_HUMAN | idh2 r140q
Type:
Enzyme Catalytic Domain
Mol. Mass.:
50823.17
Organism:
Homo sapiens (Human)
Description:
P48735 (R140Q)
Residue:
452
  
Inhibitor
Name:
BDBM497348
Synonyms:
1-Ethyl-7-[[(1S)-1-[4-[3- methyl-1-(4-prop-2- enoylpiperazin-1- yl)butyl]phenyl]ethyl]amino]- 4H-pyrimido[4,5- d][1,3]oxazin-2-one US11001596, Example 7 US11629156, Example 6 | US11649247, Example 8
Type:
Small organic molecule
Emp. Form.:
C28H38N6O3
Mol. Mass.:
506.6397
SMILES:
CCN1C(=O)OCc2cnc(N[C@@H](C)c3ccc(cc3)C(CC(C)C)N3CCN(CC3)C(=O)C=C)nc12
: