Target
Isocitrate dehydrogenase [NADP], mitochondrial
Ligand
BDBM497335
Substrate
Meas. Tech.
Biochemical Assay
IC50
884±748 nM
Citation
 Bauer, RABoulet, SLBurkholder, TPHahn, PJRankovic, Z 7-phenylethylamino-4H-pyrimido[4,5-d][1,3]oxazin-2-one compounds as mutant IDH1 and IDH2 inhibitors US Patent  US11001596 Publication Date 5/11/2021 
Target
Name:
Isocitrate dehydrogenase [NADP], mitochondrial
Synonyms:
IDH2 IDHP_HUMAN | Isocitrate dehydrogenase 2 (IDH2)
Type:
Protein
Mol. Mass.:
50923.31
Organism:
Homo sapiens (Human)
Description:
Full-length wild-type
Residue:
452
  
Inhibitor
Name:
BDBM497335
Synonyms:
7-[[(1S)-1-[4-[(1S)-2- cyclopropyl-1-(4-prop-2- enoylpiperazin-1-yl) ethyl]phenyl]ethyl]amino]- 1-ethyl-4H-pyrimido[4,5- d][1,3]oxazin-2-one US11629156, Example 2 | US11649247, Example 2
Type:
Small organic molecule
Emp. Form.:
C28H36N6O3
Mol. Mass.:
504.6238
SMILES:
CCN1C(=O)OCc2cnc(N[C@@H](C)c3ccc(cc3)[C@H](CC3CC3)N3CCN(CC3)C(=O)C=C)nc12
: