Target
Isocitrate dehydrogenase [NADP] cytoplasmic
Ligand
BDBM497353
Substrate
Meas. Tech.
Biochemical Assay
IC50
345±n/a nM
Citation
 Bauer, RABoulet, SLBurkholder, TPHahn, PJRankovic, Z 7-phenylethylamino-4H-pyrimido[4,5-d][1,3]oxazin-2-one compounds as mutant IDH1 and IDH2 inhibitors US Patent  US11001596 Publication Date 5/11/2021 
Target
Name:
Isocitrate dehydrogenase [NADP] cytoplasmic
Synonyms:
Cytosolic NADP-isocitrate dehydrogenase IDH1 IDP Isocitrate dehydrogenase 1 (IDH1) Oxalosuccinate decarboxylase | PICD
Type:
Protein
Mol. Mass.:
46661.29
Organism:
Homo sapiens (Human)
Description:
O75874
Residue:
414
  
Inhibitor
Name:
BDBM497353
Synonyms:
1-Ethyl-7-[[(1S)-1-[4- [(1R/S)-1-(4-prop-2- enoylpiperazin-1- yl)propyl]phenyl]ethyl] amino]-4H-pyrimido[4,5- d][1,3]oxazin-2-one, isomer 1 US11001596, Example 12 | US11629156, Example 11
Type:
Small organic molecule
Emp. Form.:
C26H34N6O3
Mol. Mass.:
478.5866
SMILES:
CC[C@@H](N1CCN(CC1)C(=O)C=C)c1ccc(cc1)[C@H](C)Nc1ncc2COC(=O)N(CC)c2n1
: