Target
Amine oxidase [flavin-containing] B
Ligand
BDBM173314
Substrate
Meas. Tech.
Enzymatic Assay
pH
7.4±n/a
EC50
<100±n/a nM
Comments
extracted
Citation
 PubChem, PCBasinger, JFreestone, GGupta, VKaplan, AMak, CCPratt, BSantora, VSengupta, DValdez, L Substituted naphthyridine and quinoline compounds as MAO inhibitors US Patent  US9675605 Publication Date 6/13/2017 
Target
Name:
Amine oxidase [flavin-containing] B
Synonyms:
AOFB_HUMAN MAOB Monoamine oxidase type B (MAO B) Monoamine oxidase type B (MAOB)
Type:
Protein
Mol. Mass.:
58768.76
Organism:
Homo sapiens (Human)
Description:
P27338
Residue:
520
  
Inhibitor
Name:
BDBM173314
Synonyms:
US9675605, 30
Type:
Small organic molecule
Emp. Form.:
C19H16F3NO2
Mol. Mass.:
347.331
SMILES:
CC(C)(O)c1cnc2cc(OCc3cc(F)c(F)c(F)c3)ccc2c1
: