Target
Sigma intracellular receptor 2
Ligand
BDBM497386
Substrate
Ki
18.0±n/a nM
Citation
 Godek, DMHoward, HRStewart, AM Cycloalkyl-diamines for the treatment of pain US Patent  US11007200 Publication Date 5/18/2021 
Target
Name:
Sigma intracellular receptor 2
Synonyms:
MAC30 S2R Sigma-2 receptor TMEM97 | Transmembrane protein 97
Type:
Protein
Mol. Mass.:
20857.20
Organism:
Homo sapiens (Human)
Description:
Q5BJF2
Residue:
176
  
Inhibitor
Name:
BDBM497386
Synonyms:
US11007200, Example 3a | US11426411, Example 3a
Type:
Small organic molecule
Emp. Form.:
C22H28ClFN2
Mol. Mass.:
374.923
SMILES:
CN[C@@]1(CCCC[C@@H]1NCCCc1ccc(F)cc1)c1ccccc1Cl
: