Target
Sigma intracellular receptor 2
Ligand
BDBM497389
Substrate
Ki
426±n/a nM
Citation
 Godek, DMHoward, HRStewart, AM Cycloalkyl-diamines for the treatment of pain US Patent  US11007200 Publication Date 5/18/2021 
Target
Name:
Sigma intracellular receptor 2
Synonyms:
MAC30 S2R Sigma-2 receptor TMEM97 | Transmembrane protein 97
Type:
Protein
Mol. Mass.:
20857.20
Organism:
Homo sapiens (Human)
Description:
Q5BJF2
Residue:
176
  
Inhibitor
Name:
BDBM497389
Synonyms:
US11007200, Example 4b | US11426411, Example 4b
Type:
Small organic molecule
Emp. Form.:
C22H29ClN2
Mol. Mass.:
356.932
SMILES:
CN[C@]1(CCCC[C@@H]1NCCCc1ccccc1)c1ccccc1Cl
: