Target
Sigma non-opioid intracellular receptor 1
Ligand
BDBM497390
Substrate
Meas. Tech.
Pharmacological Activity Assay
Ki
70.0±n/a nM
Citation
 Godek, DMHoward, HRStewart, AM Cycloalkyl-diamines for the treatment of pain US Patent  US11007200 Publication Date 5/18/2021 
Target
Name:
Sigma non-opioid intracellular receptor 1
Synonyms:
Aging-associated gene 8 protein SGMR1_HUMAN SIGMAR1 SR31747-binding protein Sigma 1-type opioid receptor Sigma1R | hSigmaR1
Type:
Enzyme Catalytic Domain
Mol. Mass.:
25124.85
Organism:
Homo sapiens (Human)
Description:
Q99720
Residue:
223
  
Inhibitor
Name:
BDBM497390
Synonyms:
US11007200, Example 13a | US11426411, Example 13a
Type:
Small organic molecule
Emp. Form.:
C21H35ClN4
Mol. Mass.:
378.982
SMILES:
CN[C@@]1(CCCC[C@@H]1NCCCN1CCN(C)CC1)c1ccccc1Cl
: