Target
fMet-Leu-Phe receptor
Ligand
BDBM497405
Substrate
Meas. Tech.
cAMP Assay
EC50
190±n/a nM
Citation
 Shirude, PSChattopadhyay, AKRachamreddy, CWurtz, NRKick, EK Piperidinone formyl peptide 2 receptor agonists US Patent  US11008301 Publication Date 5/18/2021 
Target
Name:
fMet-Leu-Phe receptor
Synonyms:
FPR FPR1_HUMAN N-formyl peptide receptor 1 fMLP receptor formyl peptide receptor 1
Type:
Enzyme Catalytic Domain
Mol. Mass.:
38456.14
Organism:
Homo sapiens (Human)
Description:
gi_4503779
Residue:
350
  
Inhibitor
Name:
BDBM497405
Synonyms:
US11008301, Example 69
Type:
Small organic molecule
Emp. Form.:
C25H28F3N5O3
Mol. Mass.:
503.5167
SMILES:
CC(=O)N[C@@H]1CCN(C1)c1ccc(cc1)N1CCC[C@@H](NC(=O)Nc2ccc(cc2)C(F)(F)F)C1=O
: