Target
N-formyl peptide receptor 2
Ligand
BDBM497406
Substrate
Meas. Tech.
cAMP Assay
EC50
2.40±n/a nM
Citation
 Shirude, PSChattopadhyay, AKRachamreddy, CWurtz, NRKick, EK Piperidinone formyl peptide 2 receptor agonists US Patent  US11008301 Publication Date 5/18/2021 
Target
Name:
N-formyl peptide receptor 2
Synonyms:
ALXR, FPRL1, FPR2 FPR2 FPRH1 Formyl Peptide Receptor-Like 1 LXA4 receptor Lipoxin A4 receptor RFP | hFPRL
Type:
G Protein-Coupled Receptor (GPCR)
Mol. Mass.:
38968.35
Organism:
Homo sapiens (Human)
Description:
P25090
Residue:
351
  
Inhibitor
Name:
BDBM497406
Synonyms:
US11008301, Example 70
Type:
Small organic molecule
Emp. Form.:
C24H25F5N4O2
Mol. Mass.:
496.4729
SMILES:
FC(F)(F)c1ccc(NC(=O)N[C@@H]2CCCN(C2=O)c2ccc(cc2)N2CCCC(F)(F)C2)cc1
: