Target
N-formyl peptide receptor 2
Ligand
BDBM497408
Substrate
Meas. Tech.
cAMP Assay
EC50
0.310±n/a nM
Citation
 Shirude, PSChattopadhyay, AKRachamreddy, CWurtz, NRKick, EK Piperidinone formyl peptide 2 receptor agonists US Patent  US11008301 Publication Date 5/18/2021 
Target
Name:
N-formyl peptide receptor 2
Synonyms:
ALXR, FPRL1, FPR2 FPR2 FPRH1 Formyl Peptide Receptor-Like 1 LXA4 receptor Lipoxin A4 receptor RFP | hFPRL
Type:
G Protein-Coupled Receptor (GPCR)
Mol. Mass.:
38968.35
Organism:
Homo sapiens (Human)
Description:
P25090
Residue:
351
  
Inhibitor
Name:
BDBM497408
Synonyms:
US11008301, Example 81
Type:
Small organic molecule
Emp. Form.:
C24H28ClF2N5O2
Mol. Mass.:
491.961
SMILES:
CN(C)C1CCN(C1)c1ccc(N2CCC[C@@H](NC(=O)Nc3ccc(Cl)cc3F)C2=O)c(F)c1
: