Target
Mitogen-activated protein kinase kinase kinase 5
Ligand
BDBM497418
Substrate
Meas. Tech.
HTRF KinEASE Assay
IC50
55±n/a nM
Citation
 Wang, GShen, RGranger, BHe, JXing, XHe, YLong, JMa, JWang, BOr, YS Tetrazole containing apoptosis signal-regulating kinase 1 inhibitors and methods of use thereof US Patent  US11008304 Publication Date 5/18/2021 
Target
Name:
Mitogen-activated protein kinase kinase kinase 5
Synonyms:
ASK1 MAP3K5 MEKK5
Type:
Protein
Mol. Mass.:
154514.93
Organism:
Homo sapiens (Human)
Description:
Q99683
Residue:
1374
  
Inhibitor
Name:
BDBM497418
Synonyms:
US11008304, Example 5
Type:
Small organic molecule
Emp. Form.:
C26H30N10O
Mol. Mass.:
498.5828
SMILES:
CC(C)n1nnnc1-c1cccc(NC(=O)c2cc(-c3cnn(c3)C3CC3)c(cn2)N2CCCCC2)n1
: