Target
Mitogen-activated protein kinase kinase kinase 5
Ligand
BDBM497459
Substrate
Meas. Tech.
HTRF KinEASE Assay
IC50
5.5±n/a nM
Citation
 Wang, GShen, RGranger, BHe, JXing, XHe, YLong, JMa, JWang, BOr, YS Tetrazole containing apoptosis signal-regulating kinase 1 inhibitors and methods of use thereof US Patent  US11008304 Publication Date 5/18/2021 
Target
Name:
Mitogen-activated protein kinase kinase kinase 5
Synonyms:
ASK1 MAP3K5 MEKK5
Type:
Protein
Mol. Mass.:
154514.93
Organism:
Homo sapiens (Human)
Description:
Q99683
Residue:
1374
  
Inhibitor
Name:
BDBM497459
Synonyms:
US11008304, Example 46
Type:
Small organic molecule
Emp. Form.:
C23H23FN8O
Mol. Mass.:
446.4801
SMILES:
CC(C)n1nnnc1-c1cccc(NC(=O)c2cc(-c3cnn(c3)C3CC3)c(C)cc2F)n1
: