Target
Mitogen-activated protein kinase kinase kinase 5
Ligand
BDBM497477
Substrate
Meas. Tech.
HTRF KinEASE Assay
IC50
55±n/a nM
Citation
 Wang, GShen, RGranger, BHe, JXing, XHe, YLong, JMa, JWang, BOr, YS Tetrazole containing apoptosis signal-regulating kinase 1 inhibitors and methods of use thereof US Patent  US11008304 Publication Date 5/18/2021 
Target
Name:
Mitogen-activated protein kinase kinase kinase 5
Synonyms:
ASK1 MAP3K5 MEKK5
Type:
Protein
Mol. Mass.:
154514.93
Organism:
Homo sapiens (Human)
Description:
Q99683
Residue:
1374
  
Inhibitor
Name:
BDBM497477
Synonyms:
US11008304, Example 63
Type:
Small organic molecule
Emp. Form.:
C23H25FN8O2
Mol. Mass.:
464.4954
SMILES:
CC(C)n1cnc(c1)-c1cc(C(=O)Nc2cccc(n2)-c2nnnn2[C@H](C)CO)c(F)cc1C
: