Target
Nuclear receptor ROR-gamma
Ligand
BDBM497527
Substrate
Meas. Tech.
In Vitro Ligand Binding Assay
IC50
3.60±n/a nM
Citation
 Bronner, SMCrawford, JJCridland, ACyr, PFauber, BGancia, EGobbi, AHurley, CKillen, JLee, WRene, OVan Niel, MBWard, SWinship, PZbieg, J Pyridazine derivatives as RORc modulators US Patent  US11008312 Publication Date 5/18/2021 
Target
Name:
Nuclear receptor ROR-gamma
Synonyms:
NR1F3 Nuclear receptor ROR-gamma (RORC) RAR-related orphan receptor C (RORc) RORG RZRG Retinoid-related orphan receptor-gamma (RORc)
Type:
Enzyme Catalytic Domain
Mol. Mass.:
58218.40
Organism:
Homo sapiens (Human)
Description:
P51449
Residue:
518
  
Inhibitor
Name:
BDBM497527
Synonyms:
2-methyl-2-[2-[6-[(1S,8R)-5-(2,6- difluorophenyl)-11,11-dimethyl-3,4- diazatricyclo[6.2.1.02,7]undeca-2(7),3,5- trien-1-yl]pyrazin-2-yl]oxazol-4- yl]propanenitrile | US11008312, Example 27
Type:
Small organic molecule
Emp. Form.:
C28H24F2N6O
Mol. Mass.:
498.5266
SMILES:
CC(C)(C#N)c1coc(n1)-c1cncc(n1)[C@@]12CC[C@@H](c3cc(nnc13)-c1c(F)cccc1F)C2(C)C
: