Target
Nuclear receptor ROR-gamma
Ligand
BDBM497574
Substrate
Meas. Tech.
In Vitro Ligand Binding Assay
IC50
3.20±n/a nM
Citation
 Bronner, SMCrawford, JJCridland, ACyr, PFauber, BGancia, EGobbi, AHurley, CKillen, JLee, WRene, OVan Niel, MBWard, SWinship, PZbieg, J Pyridazine derivatives as RORc modulators US Patent  US11008312 Publication Date 5/18/2021 
Target
Name:
Nuclear receptor ROR-gamma
Synonyms:
NR1F3 Nuclear receptor ROR-gamma (RORC) RAR-related orphan receptor C (RORc) RORG RZRG Retinoid-related orphan receptor-gamma (RORc)
Type:
Enzyme Catalytic Domain
Mol. Mass.:
58218.40
Organism:
Homo sapiens (Human)
Description:
P51449
Residue:
518
  
Inhibitor
Name:
BDBM497574
Synonyms:
(1S,8R)-5-(2,6-difluorophenyl)-11,11- dimethyl-1-[6-[1-(2- methylsulfonylethyl)pyrazol-4-yl]-2- pyridyl]-3,4- diazatricyclo[6.2.1.02,7]undeca-2(7),3,5- triene | US11008312, Example 69
Type:
Small organic molecule
Emp. Form.:
C28H27F2N5O2S
Mol. Mass.:
535.608
SMILES:
CC1(C)[C@H]2CC[C@@]1(c1nnc(cc21)-c1c(F)cccc1F)c1cccc(n1)-c1cnn(CCS(C)(=O)=O)c1
: