Target
Nuclear receptor ROR-gamma
Ligand
BDBM497703
Substrate
Meas. Tech.
In Vitro Ligand Binding Assay
IC50
5.00±n/a nM
Citation
 Bronner, SMCrawford, JJCridland, ACyr, PFauber, BGancia, EGobbi, AHurley, CKillen, JLee, WRene, OVan Niel, MBWard, SWinship, PZbieg, J Pyridazine derivatives as RORc modulators US Patent  US11008312 Publication Date 5/18/2021 
Target
Name:
Nuclear receptor ROR-gamma
Synonyms:
NR1F3 Nuclear receptor ROR-gamma (RORC) RAR-related orphan receptor C (RORc) RORG RZRG Retinoid-related orphan receptor-gamma (RORc)
Type:
Enzyme Catalytic Domain
Mol. Mass.:
58218.40
Organism:
Homo sapiens (Human)
Description:
P51449
Residue:
518
  
Inhibitor
Name:
BDBM497703
Synonyms:
N-[[1-[6-[(1S,8R)-5-(2,6-difluorophenyl)- 11,11-dimethyl-3,4- diazatricyclo[6.2.1.02,7]undeca-2(7),3,5- trien-1-yl]pyrazin-2-yl]pyrazol-3- yl]methyl]methanesulfonamide | US11008312, Example 197
Type:
Small organic molecule
Emp. Form.:
C26H25F2N7O2S
Mol. Mass.:
537.584
SMILES:
CC1(C)[C@H]2CC[C@@]1(c1nnc(cc21)-c1c(F)cccc1F)c1cncc(n1)-n1ccc(CNS(C)(=O)=O)n1
: