Target
Nuclear receptor ROR-gamma
Ligand
BDBM497855
Substrate
Meas. Tech.
In Vitro Ligand Binding Assay
IC50
3.10±n/a nM
Citation
 Bronner, SMCrawford, JJCridland, ACyr, PFauber, BGancia, EGobbi, AHurley, CKillen, JLee, WRene, OVan Niel, MBWard, SWinship, PZbieg, J Pyridazine derivatives as RORc modulators US Patent  US11008312 Publication Date 5/18/2021 
Target
Name:
Nuclear receptor ROR-gamma
Synonyms:
NR1F3 Nuclear receptor ROR-gamma (RORC) RAR-related orphan receptor C (RORc) RORG RZRG Retinoid-related orphan receptor-gamma (RORc)
Type:
Enzyme Catalytic Domain
Mol. Mass.:
58218.40
Organism:
Homo sapiens (Human)
Description:
P51449
Residue:
518
  
Inhibitor
Name:
BDBM497855
Synonyms:
(5R,8S)-8-(6-(3-(difluoromethyl)-1H- 1,2,4-triazol-1-yl)pyridin-2-yl)-3-(2,6- difluorophenyl)-9,9-dimethyl-5,6,7,8- tetrahydro-5,8-methanocinnoline | US11008312, Example 327
Type:
Small organic molecule
Emp. Form.:
C25H20F4N6
Mol. Mass.:
480.4601
SMILES:
CC1(C)[C@H]2CC[C@@]1(c1nnc(cc21)-c1c(F)cccc1F)c1cccc(n1)-n1cnc(n1)C(F)F
: