Target
Tyrosine-protein kinase ITK/TSK
Ligand
BDBM497907
Substrate
Meas. Tech.
In Vitro Assay
IC50
<10±n/a nM
Citation
 Hudson, RBeausoleil, A Compounds and methods for modulating interleukin-2-inducible t-cell kinase US Patent  US11008314 Publication Date 5/18/2021 
Target
Name:
Tyrosine-protein kinase ITK/TSK
Synonyms:
EMT ITK_HUMAN LYK Tyrosine-protein kinase ITK Tyrosine-protein kinase Lyk
Type:
Protein
Mol. Mass.:
71839.20
Organism:
Homo sapiens (Human)
Description:
Q08881
Residue:
620
  
Inhibitor
Name:
BDBM497907
Synonyms:
US11008314, Compound 1
Type:
Small organic molecule
Emp. Form.:
C23H26N4O4S2
Mol. Mass.:
486.607
SMILES:
COc1cc(C)c(Sc2cnc(NC(=O)C3CC3)s2)cc1C(=O)N1CCN(CC1)C(=O)C=C
: