Target
Tyrosine-protein kinase ITK/TSK
Ligand
BDBM497962
Substrate
Meas. Tech.
In Vitro Assay
IC50
<10±n/a nM
Citation
 Hudson, RBeausoleil, A Compounds and methods for modulating interleukin-2-inducible t-cell kinase US Patent  US11008314 Publication Date 5/18/2021 
Target
Name:
Tyrosine-protein kinase ITK/TSK
Synonyms:
EMT ITK_HUMAN LYK Tyrosine-protein kinase ITK Tyrosine-protein kinase Lyk
Type:
Protein
Mol. Mass.:
71839.20
Organism:
Homo sapiens (Human)
Description:
Q08881
Residue:
620
  
Inhibitor
Name:
BDBM497962
Synonyms:
US11008314, Compound 51
Type:
Small organic molecule
Emp. Form.:
C23H28N4O4S2
Mol. Mass.:
488.623
SMILES:
CCC(=O)Nc1ncc(Sc2cc(C(=O)N3CCN(C[C@@H]3C)C(=O)C=C)c(OC)cc2C)s1
: