Target
Tyrosine-protein kinase ITK/TSK
Ligand
BDBM497987
Substrate
Meas. Tech.
In Vitro Assay
IC50
<10±n/a nM
Citation
 Hudson, RBeausoleil, A Compounds and methods for modulating interleukin-2-inducible t-cell kinase US Patent  US11008314 Publication Date 5/18/2021 
Target
Name:
Tyrosine-protein kinase ITK/TSK
Synonyms:
EMT ITK_HUMAN LYK Tyrosine-protein kinase ITK Tyrosine-protein kinase Lyk
Type:
Protein
Mol. Mass.:
71839.20
Organism:
Homo sapiens (Human)
Description:
Q08881
Residue:
620
  
Inhibitor
Name:
BDBM497987
Synonyms:
US11008314, Compound 75
Type:
Small organic molecule
Emp. Form.:
C24H28N4O3S2
Mol. Mass.:
484.634
SMILES:
C[C@@H]1CN(CCN1C(=O)C=C)C(=O)c1cc(Sc2cnc(NC(=O)C3CC3)s2)c(C)cc1C
: