Target
Tyrosine-protein kinase TXK
Ligand
BDBM498068
Substrate
Meas. Tech.
In Vitro Assay
IC50
<10±n/a nM
Citation
 Hudson, RBeausoleil, A Compounds and methods for modulating interleukin-2-inducible t-cell kinase US Patent  US11008314 Publication Date 5/18/2021 
Target
Name:
Tyrosine-protein kinase TXK
Synonyms:
PTK4 RLK TXK Tyrosine-protein kinase TXK (TXK)
Type:
Protein
Mol. Mass.:
61268.80
Organism:
Homo sapiens (Human)
Description:
P42681
Residue:
527
  
Inhibitor
Name:
BDBM498068
Synonyms:
US11008314, Compound 151
Type:
Small organic molecule
Emp. Form.:
C25H27N5O3S2
Mol. Mass.:
509.644
SMILES:
COc1cc(C)c(Sc2cnc(Nc3ccccn3)s2)cc1C(=O)N1CCN(C[C@@H]1C)C(=O)C=C
: