Target
Beta-secretase 2
Ligand
BDBM448223
Substrate
Meas. Tech.
Time-Resolved Endpoint Proteolysis Assay
Ki
195±n/a nM
Citation
 Wu, WCumming, JNTaoka, BMDai, X C5-C6-oxacyclic fused iminothiazine dioxide compounds bearing an ether linker as BACE inhibitors, compositions, and their use US Patent  US11008338 Publication Date 5/18/2021 
Target
Name:
Beta-secretase 2
Synonyms:
AEPLC ASP1 Asp 1 Aspartyl protease 1 BACE2_HUMAN Beta-secretase (BACE) Beta-secretase 2 (BACE-2) Beta-site APP-cleaving enzyme 2 Memapsin-1 beta-Secretase (BACE-2)
Type:
Protein
Mol. Mass.:
56171.20
Organism:
Homo sapiens (Human)
Description:
Q9Y5Z0
Residue:
518
  
Inhibitor
Name:
BDBM448223
Synonyms:
US10689401, EX 25 | US11008338, Example 25
Type:
Small organic molecule
Emp. Form.:
C18H25FN2O3S
Mol. Mass.:
368.466
SMILES:
CC(C)[C@H]1C[C@@H]2[C@](CO1)(NC(=N)C(C)(C)S2(=O)=O)c1ccccc1F
: