Target
Lysine-specific histone demethylase 1A
Ligand
BDBM424912
Substrate
Meas. Tech.
LSD1 TR-FRET Assay
IC50
<100±n/a nM
Citation
 Brucelle, FGehling, VSKhanna, A LSD1 inhibitors and medical uses thereof US Patent  US11013718 Publication Date 5/25/2021 
Target
Name:
Lysine-specific histone demethylase 1A
Synonyms:
AOF2 Flavin-containing amine oxidase domain-containing protein 2 KDM1A KIAA0601 Lysine-specific demethylase 1 (LSD1) Lysine-specific histone demethylase 1 (LSD1)
Type:
Enzyme
Mol. Mass.:
92901.01
Organism:
Homo sapiens (Human)
Description:
O60341
Residue:
852
  
Inhibitor
Name:
BDBM424912
Synonyms:
2-(6-(((1R,2S)-2-((E)-1-phenylbut-1-en-2-yl)cyclopropyl)amino)-2-azaspiro[3.3]heptan-2-yl)ethanol US11013718, Compound 1 | US11547695, Compound 1
Type:
Small organic molecule
Emp. Form.:
C21H30N2O
Mol. Mass.:
326.4757
SMILES:
CC\C(=C/c1ccccc1)[C@@H]1C[C@H]1NC1CC2(C1)CN(CCO)C2
: