Target
Histone-binding protein RBBP4/Histone-lysine N-methyltransferase EZH2/Polycomb protein EED [40-441]/Polycomb protein SUZ12
Ligand
BDBM498109
Substrate
Meas. Tech.
TR-FRET Assay
IC50
204±n/a nM
Citation
 Zhou, BLuo, CYang, YZhang, YDu, DJiang, HQiao, GWang, X Triazolopyrimidine, triazolopyridine compounds, and the composition thereof for treating PRC2-mediated diseases US Patent  US11013745 Publication Date 5/25/2021 
Target
Name:
Histone-binding protein RBBP4/Histone-lysine N-methyltransferase EZH2/Polycomb protein EED [40-441]/Polycomb protein SUZ12
Synonyms:
Polycomb Repressive Complex 2 (PRC2)
Type:
Protein
Mol. Mass.:
Description:
Components:
This complex has 4 components.
Component 1
Name:
Polycomb protein EED [40-441]
Synonyms:
EED Polycomb protein EED (EED)
Type:
Protein
Mol. Mass.:
46101.42
Organism:
Homo sapiens (Human)
Description:
Human polycomb protein EED (40-441 aa)
Residue:
402
  
Component 2
Name:
Polycomb protein SUZ12
Synonyms:
CHET9 Chromatin precipitated E2F target 9 protein Joined to JAZF1 protein Polycomb protein SUZ12 SUZ12 Suppressor of zeste 12 protein homolog
Type:
Protein
Mol. Mass.:
83080.09
Organism:
Homo sapiens (Human)
Description:
Q15022
Residue:
739
  
Component 3
Name:
Histone-binding protein RBBP4
Synonyms:
RBAP48 RBBP4_HUMAN | Retinoblastoma-binding protein p48 (RBAP48)
Type:
Protein
Mol. Mass.:
47627.91
Organism:
Homo sapiens (Human)
Description:
Q09028
Residue:
425
  
Component 4
Name:
Histone-lysine N-methyltransferase EZH2
Synonyms:
ENX-1 EZH2_HUMAN Histone-lysine N-methyltransferase EZH2 Lysine N-methyltransferase 6
Type:
Protein
Mol. Mass.:
85367.84
Organism:
Homo sapiens (Human)
Description:
Q15910
Residue:
746
  
Inhibitor
Name:
BDBM498109
Synonyms:
US11013745, Compound E-Y24
Type:
Small organic molecule
Emp. Form.:
C18H21N7O2
Mol. Mass.:
367.405
SMILES:
CCNC(=O)N1CCC(=CC1)c1cnc(NCc2ccco2)n2cnnc12
: