Target
D(4) dopamine receptor
Ligand
BDBM466552
Substrate
Meas. Tech.
Binding Activity Assay
Ki
111±n/a nM
Citation
 Yoshinaga, HUemachi, HOhno, TBesnard, J 2,6-disubstituted pyridine derivative US Patent  US11014905 Publication Date 5/25/2021 
Target
Name:
D(4) dopamine receptor
Synonyms:
D(2C) dopamine receptor DOPAMINE D4.2 DRD4 Dopamine D4 receptor
Type:
Enzyme
Mol. Mass.:
48373.19
Organism:
Homo sapiens (Human)
Description:
P21917
Residue:
419
  
Inhibitor
Name:
BDBM466552
Synonyms:
N-{2-[4-(6-Methylpyridin-2-yl)piperidin-1-yl]ethyl}-tetrahydro-2H-pyran-4-carboxamide US11014905, Example 8
Type:
Small organic molecule
Emp. Form.:
C19H29N3O2
Mol. Mass.:
331.4525
SMILES:
Cc1cccc(n1)C1CCN(CCNC(=O)C2CCOCC2)CC1
: