Target
D(2) dopamine receptor
Ligand
BDBM466556
Substrate
Meas. Tech.
Binding Activity Assay
Ki
0.200±n/a nM
Citation
 Yoshinaga, HUemachi, HOhno, TBesnard, J 2,6-disubstituted pyridine derivative US Patent  US11014905 Publication Date 5/25/2021 
Target
Name:
D(2) dopamine receptor
Synonyms:
D(2) dopamine receptor DOPAMINE D2 Long DRD2 Dopamine D2 receptor Dopamine D2 receptor (D2R) Dopamine2-like | d2
Type:
Cell-surface receptors
Mol. Mass.:
50647.10
Organism:
Homo sapiens (Human)
Description:
P14416
Residue:
443
  
Inhibitor
Name:
BDBM466556
Synonyms:
4,4-Difluoro-N-{2-[6-(trifluoromethyl)-3′,6′-dihydro[2,4′-bipyridin]-1′ (2′H)-yl]ethyl}-cyclohexane-1-carboxamide US11014905, Example 12
Type:
Small organic molecule
Emp. Form.:
C20H24F5N3O
Mol. Mass.:
417.4161
SMILES:
FC(F)(F)c1cccc(n1)C1=CCN(CCNC(=O)C2CCC(F)(F)CC2)CC1
: