Target
5-hydroxytryptamine receptor 1A
Ligand
BDBM466556
Substrate
Meas. Tech.
Binding Activity Assay
Ki
357±n/a nM
Citation
 Yoshinaga, HUemachi, HOhno, TBesnard, J 2,6-disubstituted pyridine derivative US Patent  US11014905 Publication Date 5/25/2021 
Target
Name:
5-hydroxytryptamine receptor 1A
Synonyms:
5-HT-1A 5-hydroxytryptamine receptor 1A (5-HT-1A) ADRB2RL1 Dopamine D2 receptor and serotonin 1a receptor HTR1A | Serotonin receptor 1A
Type:
Mol. Mass.:
46122.49
Organism:
Homo sapiens (Human)
Description:
Residue:
422
  
Inhibitor
Name:
BDBM466556
Synonyms:
4,4-Difluoro-N-{2-[6-(trifluoromethyl)-3′,6′-dihydro[2,4′-bipyridin]-1′ (2′H)-yl]ethyl}-cyclohexane-1-carboxamide US11014905, Example 12
Type:
Small organic molecule
Emp. Form.:
C20H24F5N3O
Mol. Mass.:
417.4161
SMILES:
FC(F)(F)c1cccc(n1)C1=CCN(CCNC(=O)C2CCC(F)(F)CC2)CC1
: