Target
D(2) dopamine receptor
Ligand
BDBM466559
Substrate
Meas. Tech.
Binding Activity Assay
Ki
0.100±n/a nM
Citation
 Yoshinaga, HUemachi, HOhno, TBesnard, J 2,6-disubstituted pyridine derivative US Patent  US11014905 Publication Date 5/25/2021 
Target
Name:
D(2) dopamine receptor
Synonyms:
D(2) dopamine receptor DOPAMINE D2 Long DRD2 Dopamine D2 receptor Dopamine D2 receptor (D2R) Dopamine2-like | d2
Type:
Cell-surface receptors
Mol. Mass.:
50647.10
Organism:
Homo sapiens (Human)
Description:
P14416
Residue:
443
  
Inhibitor
Name:
BDBM466559
Synonyms:
US10800755, Example 14 | US11014905, Example 14
Type:
Small organic molecule
Emp. Form.:
C20H27F2N3O
Mol. Mass.:
363.4447
SMILES:
Cc1cccc(n1)C1=CCN(CCNC(=O)C2CCC(F)(F)CC2)CC1
: