Target
5-hydroxytryptamine receptor 1A
Ligand
BDBM466577
Substrate
Meas. Tech.
Binding Activity Assay
Ki
1280±n/a nM
Citation
 Yoshinaga, HUemachi, HOhno, TBesnard, J 2,6-disubstituted pyridine derivative US Patent  US11014905 Publication Date 5/25/2021 
Target
Name:
5-hydroxytryptamine receptor 1A
Synonyms:
5-HT-1A 5-hydroxytryptamine receptor 1A (5-HT-1A) ADRB2RL1 Dopamine D2 receptor and serotonin 1a receptor HTR1A | Serotonin receptor 1A
Type:
Mol. Mass.:
46122.49
Organism:
Homo sapiens (Human)
Description:
Residue:
422
  
Inhibitor
Name:
BDBM466577
Synonyms:
2,2-Dimethyl-N-{2-[6-(trifluoromethyl)-3′,6′-dihydro[2,4′-bipyridin]-1′ (2′H)-yl]ethyl}propanamide US11014905, Example 31
Type:
Small organic molecule
Emp. Form.:
C18H24F3N3O
Mol. Mass.:
355.3979
SMILES:
CC(C)(C)C(=O)NCCN1CCC(=CC1)c1cccc(n1)C(F)(F)F
: