Target
D(1A) dopamine receptor
Ligand
BDBM160916
Substrate
Meas. Tech.
Receptor Binding Assay
Ki
58.0±n/a nM
Citation
 Brodney, MADavoren, JEDounay, ABEfremov, IVGray, DLGreen, MEHenderson, JLLee, CMente, SRO''Neil, SVRogers, BNZhang, L Heteroaromatic compounds and their use as dopamine D1 ligands US Patent  US11014909 Publication Date 5/25/2021 
Target
Name:
D(1A) dopamine receptor
Synonyms:
DA D1 receptor DRD1 Dopamine D1 receptor Dopamine D1A
Type:
Enzyme
Mol. Mass.:
49303.43
Organism:
Homo sapiens (Human)
Description:
P21728
Residue:
446
  
Inhibitor
Name:
BDBM160916
Synonyms:
US11014909, Example 5 | US9107923, 5
Type:
Small organic molecule
Emp. Form.:
C19H18ClN3O3
Mol. Mass.:
371.818
SMILES:
CCn1c(c(C)c(=O)[nH]c1=O)-c1ccc(Oc2ncccc2Cl)cc1C
: