Target
D(1A) dopamine receptor
Ligand
BDBM160930
Substrate
Meas. Tech.
Receptor Binding Assay
Ki
12.9±n/a nM
Citation
 Brodney, MADavoren, JEDounay, ABEfremov, IVGray, DLGreen, MEHenderson, JLLee, CMente, SRO''Neil, SVRogers, BNZhang, L Heteroaromatic compounds and their use as dopamine D1 ligands US Patent  US11014909 Publication Date 5/25/2021 
Target
Name:
D(1A) dopamine receptor
Synonyms:
DA D1 receptor DRD1 Dopamine D1 receptor Dopamine D1A
Type:
Enzyme
Mol. Mass.:
49303.43
Organism:
Homo sapiens (Human)
Description:
P21728
Residue:
446
  
Inhibitor
Name:
BDBM160930
Synonyms:
US11014909, Example 19 | US9107923, 19
Type:
Small organic molecule
Emp. Form.:
C20H15F3N4O3
Mol. Mass.:
416.3533
SMILES:
Cc1c(-c2ccc(Oc3ncccc3C(F)(F)F)c3[nH]ccc23)n(C)c(=O)[nH]c1=O
: