Target
D(1A) dopamine receptor
Ligand
BDBM498196
Substrate
Meas. Tech.
Receptor Binding Assay
Ki
45.9±n/a nM
Citation
 Brodney, MADavoren, JEDounay, ABEfremov, IVGray, DLGreen, MEHenderson, JLLee, CMente, SRO''Neil, SVRogers, BNZhang, L Heteroaromatic compounds and their use as dopamine D1 ligands US Patent  US11014909 Publication Date 5/25/2021 
Target
Name:
D(1A) dopamine receptor
Synonyms:
DA D1 receptor DRD1 Dopamine D1 receptor Dopamine D1A
Type:
Enzyme
Mol. Mass.:
49303.43
Organism:
Homo sapiens (Human)
Description:
P21728
Residue:
446
  
Inhibitor
Name:
BDBM498196
Synonyms:
2-[4-(3,5-dimethyl-2,6-dioxo-1,2,3,6-tetrahydropyrimidin-4-yl)-3- methylphenoxy]-4-methylpyridine-3-carbonitrile | US11014909, Example 23
Type:
Small organic molecule
Emp. Form.:
C20H18N4O3
Mol. Mass.:
362.3819
SMILES:
Cc1ccnc(Oc2ccc(c(C)c2)-c2c(C)c(=O)[nH]c(=O)n2C)c1C#N
: