Target
D(1A) dopamine receptor
Ligand
BDBM160875
Substrate
Meas. Tech.
Receptor Binding Assay
Ki
18.6±n/a nM
Citation
 Brodney, MADavoren, JEDounay, ABEfremov, IVGray, DLGreen, MEHenderson, JLLee, CMente, SRO''Neil, SVRogers, BNZhang, L Heteroaromatic compounds and their use as dopamine D1 ligands US Patent  US11014909 Publication Date 5/25/2021 
Target
Name:
D(1A) dopamine receptor
Synonyms:
DA D1 receptor DRD1 Dopamine D1 receptor Dopamine D1A
Type:
Enzyme
Mol. Mass.:
49303.43
Organism:
Homo sapiens (Human)
Description:
P21728
Residue:
446
  
Inhibitor
Name:
BDBM160875
Synonyms:
US10093655, Example 45 US9107923, 45
Type:
Small organic molecule
Emp. Form.:
C19H17F2N3O4
Mol. Mass.:
389.3528
SMILES:
Cc1cc(Oc2ncccc2OC(F)F)ccc1-c1c(C)c(=O)[nH]c(=O)n1C
: