Target
D(1A) dopamine receptor
Ligand
BDBM160883
Substrate
Meas. Tech.
Receptor Binding Assay
Ki
109±n/a nM
Citation
 Brodney, MADavoren, JEDounay, ABEfremov, IVGray, DLGreen, MEHenderson, JLLee, CMente, SRO''Neil, SVRogers, BNZhang, L Heteroaromatic compounds and their use as dopamine D1 ligands US Patent  US11014909 Publication Date 5/25/2021 
Target
Name:
D(1A) dopamine receptor
Synonyms:
DA D1 receptor DRD1 Dopamine D1 receptor Dopamine D1A
Type:
Enzyme
Mol. Mass.:
49303.43
Organism:
Homo sapiens (Human)
Description:
P21728
Residue:
446
  
Inhibitor
Name:
BDBM160883
Synonyms:
US10093655, Example 53 US9107923, 53
Type:
Small organic molecule
Emp. Form.:
C18H15F2N3O4
Mol. Mass.:
375.3262
SMILES:
Cc1c(-c2ccc(Oc3ncccc3OC(F)F)cc2)n(C)c(=O)[nH]c1=O
: