Target
Cyclin-dependent kinase 2/G1/S-specific cyclin-E1
Ligand
BDBM498214
Substrate
Meas. Tech.
Biochemical Assay
Ki
0.140±n/a nM
Citation
 Behenna, DCFreeman-Cook, KDHoffman, RLNagata, ANinkovic, SSutton, SC CDK2 inhibitors US Patent  US11014911 Publication Date 5/25/2021 
Target
Name:
Cyclin-dependent kinase 2/G1/S-specific cyclin-E1
Synonyms:
CDK2/CycE CDK2/E Cyclin-Dependent Kinase 2 (CDK2) Cyclin-dependent kinase 2/cyclin E1
Type:
Protein
Mol. Mass.:
Description:
Components:
This complex has 2 components.
Component 1
Name:
Cyclin-dependent kinase 2
Synonyms:
CDK2 CDK2_HUMAN Cell division protein kinase 2 Protein cereblon/Cyclin-dependent kinase 2 | p33 protein kinase
Type:
Enzyme Subunit
Mol. Mass.:
33938.17
Organism:
Homo sapiens (Human)
Description:
P24941
Residue:
298
  
Component 2
Name:
G1/S-specific cyclin-E1
Synonyms:
CCNE CCNE1_HUMAN
Type:
Enzyme Subunit
Mol. Mass.:
47073.17
Organism:
Homo sapiens (Human)
Description:
Residue:
410
  
Inhibitor
Name:
BDBM498214
Synonyms:
US11014911, Example 39 | US11718603, Example 39
Type:
Small organic molecule
Emp. Form.:
C20H26N8O3
Mol. Mass.:
426.4722
SMILES:
CC[C@H](C)NC(=O)O[C@@H]1CC[C@@H](C1)c1cc(NC(=O)Cc2cnc3ncnn3c2)n[nH]1
: