Target
Ubiquitin carboxyl-terminal hydrolase 30
Ligand
BDBM498844
Substrate
Meas. Tech.
Biochemical Assay
IC50
550±n/a nM
Citation
 Stockley, MLKemp, MIMadin, AWoodrow, MDJones, A Cyanopyrrolidine derivatives with activity as inhibitors of USP30 US Patent  US11014912 Publication Date 5/25/2021 
Target
Name:
Ubiquitin carboxyl-terminal hydrolase 30
Synonyms:
Deubiquitinating enzyme 30 USP30 Ubiquitin carboxyl-terminal hydrolase 30 (USP30) Ubiquitin-specific-processing protease 30
Type:
Protein
Mol. Mass.:
58522.90
Organism:
Homo sapiens (Human)
Description:
Q70CQ3
Residue:
517
  
Inhibitor
Name:
BDBM498844
Synonyms:
N-(4-Chloro-3- (trifluoromethyl)phenyl)-2-(1- cyanopyrrolidin-3- ylidene)acetamide | US11014912, Example 20
Type:
Small organic molecule
Emp. Form.:
C14H11ClF3N3O
Mol. Mass.:
329.705
SMILES:
FC(F)(F)c1cc(NC(=O)C=C2CCN(C2)C#N)ccc1Cl
: