Target
Ubiquitin carboxyl-terminal hydrolase 30
Ligand
BDBM498850
Substrate
Meas. Tech.
Biochemical Assay
IC50
550±n/a nM
Citation
 Stockley, MLKemp, MIMadin, AWoodrow, MDJones, A Cyanopyrrolidine derivatives with activity as inhibitors of USP30 US Patent  US11014912 Publication Date 5/25/2021 
Target
Name:
Ubiquitin carboxyl-terminal hydrolase 30
Synonyms:
Deubiquitinating enzyme 30 USP30 Ubiquitin carboxyl-terminal hydrolase 30 (USP30) Ubiquitin-specific-processing protease 30
Type:
Protein
Mol. Mass.:
58522.90
Organism:
Homo sapiens (Human)
Description:
Q70CQ3
Residue:
517
  
Inhibitor
Name:
BDBM498850
Synonyms:
2-(1-Cyanopyrrolidin-3- ylidene)-N-methyl-N-(3- (pyridin-4-yl)benzyl)acetamide | US11014912, Example 26
Type:
Small organic molecule
Emp. Form.:
C20H20N4O
Mol. Mass.:
332.399
SMILES:
CN(Cc1cccc(c1)-c1ccncc1)C(=O)C=C1CCN(C1)C#N
: