Target
Ubiquitin carboxyl-terminal hydrolase 30
Ligand
BDBM498865
Substrate
Meas. Tech.
Biochemical Assay
IC50
550±n/a nM
Citation
 Stockley, MLKemp, MIMadin, AWoodrow, MDJones, A Cyanopyrrolidine derivatives with activity as inhibitors of USP30 US Patent  US11014912 Publication Date 5/25/2021 
Target
Name:
Ubiquitin carboxyl-terminal hydrolase 30
Synonyms:
Deubiquitinating enzyme 30 USP30 Ubiquitin carboxyl-terminal hydrolase 30 (USP30) Ubiquitin-specific-processing protease 30
Type:
Protein
Mol. Mass.:
58522.90
Organism:
Homo sapiens (Human)
Description:
Q70CQ3
Residue:
517
  
Inhibitor
Name:
BDBM498865
Synonyms:
US11014912, Example 41
Type:
Small organic molecule
Emp. Form.:
C15H15N5OS
Mol. Mass.:
313.378
SMILES:
O=C(CC1CCN(C1)C#N)Nc1nnc(s1)-c1ccccc1
: