Target
Ubiquitin carboxyl-terminal hydrolase 30
Ligand
BDBM498873
Substrate
Meas. Tech.
Biochemical Assay
IC50
550±n/a nM
Citation
 Stockley, MLKemp, MIMadin, AWoodrow, MDJones, A Cyanopyrrolidine derivatives with activity as inhibitors of USP30 US Patent  US11014912 Publication Date 5/25/2021 
Target
Name:
Ubiquitin carboxyl-terminal hydrolase 30
Synonyms:
Deubiquitinating enzyme 30 USP30 Ubiquitin carboxyl-terminal hydrolase 30 (USP30) Ubiquitin-specific-processing protease 30
Type:
Protein
Mol. Mass.:
58522.90
Organism:
Homo sapiens (Human)
Description:
Q70CQ3
Residue:
517
  
Inhibitor
Name:
BDBM498873
Synonyms:
US11014912, Example 49
Type:
Small organic molecule
Emp. Form.:
C16H14N6O2
Mol. Mass.:
322.3214
SMILES:
O=C(CC1CCN(C1)C#N)Nc1nnc(o1)-c1cccc(c1)C#N
: