Target
Protein mono-ADP-ribosyltransferase TIPARP
Ligand
BDBM431682
Substrate
Meas. Tech.
Enzymatic Assay
IC50
<100±n/a nM
Citation
 Vasbinder, MMSchenkel, LBSwinger, KKKuntz, KW Pyridazinones as PARP7 inhibitors US Patent  US11014913 Publication Date 5/25/2021 
Target
Name:
Protein mono-ADP-ribosyltransferase TIPARP
Synonyms:
ADP-ribosyltransferase diphtheria toxin-like 14 PARP-7 PARPT_HUMAN TCDD-inducible poly [ADP-ribose] polymerase | TIPARP
Type:
Protein
Mol. Mass.:
76228.44
Organism:
Human
Description:
Q7Z3E1
Residue:
657
  
Inhibitor
Name:
BDBM431682
Synonyms:
US10550105, Example 574D US11014913, Example 574D
Type:
Small organic molecule
Emp. Form.:
C21H22F6N6O4
Mol. Mass.:
536.4276
SMILES:
FC(F)(F)c1cnc(nc1)N1CCN(CC1)C(=O)C[C@@H]1CC[C@H](COc2cn[nH]c(=O)c2C(F)(F)F)O1
: