Target
Protein mono-ADP-ribosyltransferase TIPARP
Ligand
BDBM431755
Substrate
Meas. Tech.
Enzymatic Assay
IC50
<100±n/a nM
Citation
 Vasbinder, MMSchenkel, LBSwinger, KKKuntz, KW Pyridazinones as PARP7 inhibitors US Patent  US11014913 Publication Date 5/25/2021 
Target
Name:
Protein mono-ADP-ribosyltransferase TIPARP
Synonyms:
ADP-ribosyltransferase diphtheria toxin-like 14 PARP-7 PARPT_HUMAN TCDD-inducible poly [ADP-ribose] polymerase | TIPARP
Type:
Protein
Mol. Mass.:
76228.44
Organism:
Human
Description:
Q7Z3E1
Residue:
657
  
Inhibitor
Name:
BDBM431755
Synonyms:
US10550105, Example 621B US11014913, Example 621B
Type:
Small organic molecule
Emp. Form.:
C20H22F6N6O3S
Mol. Mass.:
540.482
SMILES:
C[C@H](CSCCC(=O)N1CCN(CC1)c1ncc(cn1)C(F)(F)F)Oc1cn[nH]c(=O)c1C(F)(F)F
: