Target
Protein mono-ADP-ribosyltransferase TIPARP
Ligand
BDBM431758
Substrate
Meas. Tech.
Enzymatic Assay
IC50
<100±n/a nM
Citation
 Vasbinder, MMSchenkel, LBSwinger, KKKuntz, KW Pyridazinones as PARP7 inhibitors US Patent  US11014913 Publication Date 5/25/2021 
Target
Name:
Protein mono-ADP-ribosyltransferase TIPARP
Synonyms:
ADP-ribosyltransferase diphtheria toxin-like 14 PARP-7 PARPT_HUMAN TCDD-inducible poly [ADP-ribose] polymerase | TIPARP
Type:
Protein
Mol. Mass.:
76228.44
Organism:
Human
Description:
Q7Z3E1
Residue:
657
  
Inhibitor
Name:
BDBM431758
Synonyms:
(S)-5-((1-Methoxy-3-(2-[(4-(5-(trifluoromethyl)pyrimidin-2-yl)piperazin-1-yl)sulfonyl)ethoxy)propan-2-yl)amino)-4-(trifluoromethyl)pyridazin-3(2H)-one US10870641, Example 624 | US11014913, Example 624
Type:
Small organic molecule
Emp. Form.:
C20H25F6N7O5S
Mol. Mass.:
589.512
SMILES:
COC[C@@H](COCCS(=O)(=O)N1CCN(CC1)c1ncc(cn1)C(F)(F)F)Nc1cn[nH]c(=O)c1C(F)(F)F
: