Target
Protein mono-ADP-ribosyltransferase TIPARP
Ligand
BDBM431763
Substrate
Meas. Tech.
Enzymatic Assay
IC50
<100±n/a nM
Citation
 Vasbinder, MMSchenkel, LBSwinger, KKKuntz, KW Pyridazinones as PARP7 inhibitors US Patent  US11014913 Publication Date 5/25/2021 
Target
Name:
Protein mono-ADP-ribosyltransferase TIPARP
Synonyms:
ADP-ribosyltransferase diphtheria toxin-like 14 PARP-7 PARPT_HUMAN TCDD-inducible poly [ADP-ribose] polymerase | TIPARP
Type:
Protein
Mol. Mass.:
76228.44
Organism:
Human
Description:
Q7Z3E1
Residue:
657
  
Inhibitor
Name:
BDBM431763
Synonyms:
US10550105, Example 629 US11014913, Example 629
Type:
Small organic molecule
Emp. Form.:
C27H27F6N7O2
Mol. Mass.:
595.5394
SMILES:
FC(F)(F)c1ccc(nc1)N1CCN(CC1)C(=O)CCNC[C@H]1N(Cc2ccccc12)c1cn[nH]c(=O)c1C(F)(F)F
: