Target
Coagulation factor XII
Ligand
BDBM498901
Substrate
Meas. Tech.
Factor XIIa assay
IC50
11.5±n/a nM
Citation
 Hicks, JDMcKittrick, BAWhitehead, BRLombardo, MHan, XTaylor, JAChu, HDSo, SOrth, PWu, Z Factor XIIa inhibitors US Patent  US11014920 Publication Date 5/25/2021 
Target
Name:
Coagulation factor XII
Synonyms:
Beta-factor XIIa part 1 Carboxylesterase 2 (intestine, liver) Coagulation factor XII (FXII) Coagulation factor XIIa light chain FA12_HUMAN Factor XIIa (fXIIa) Hageman factor
Type:
Enzyme
Mol. Mass.:
67810.07
Organism:
Homo sapiens (Human)
Description:
P00748
Residue:
615
  
Inhibitor
Name:
BDBM498901
Synonyms:
(3S,4R)-4-{[(4-chloro- phenyl)carbonyl]amino}- 1-(N~2~- cyclohexyl- N~2~,N~6~,N~6~- trimethyl-D-lysyl)-N- (thiophen-2- ylmethyl)piperidine-3- carboxamide | US11014920, Compound 9
Type:
Small organic molecule
Emp. Form.:
C33H48ClN5O3S
Mol. Mass.:
630.284
SMILES:
CN(C)CCCC[C@@H](N(C)C1CCCCC1)C(=O)N1CC[C@@H](NC(=O)c2ccc(Cl)cc2)[C@H](C1)C(=O)NCc1cccs1
: