Target
Coagulation factor XII
Ligand
BDBM498909
Substrate
Meas. Tech.
Factor XIIa assay
IC50
11.5±n/a nM
Citation
 Hicks, JDMcKittrick, BAWhitehead, BRLombardo, MHan, XTaylor, JAChu, HDSo, SOrth, PWu, Z Factor XIIa inhibitors US Patent  US11014920 Publication Date 5/25/2021 
Target
Name:
Coagulation factor XII
Synonyms:
Beta-factor XIIa part 1 Carboxylesterase 2 (intestine, liver) Coagulation factor XII (FXII) Coagulation factor XIIa light chain FA12_HUMAN Factor XIIa (fXIIa) Hageman factor
Type:
Enzyme
Mol. Mass.:
67810.07
Organism:
Homo sapiens (Human)
Description:
P00748
Residue:
615
  
Inhibitor
Name:
BDBM498909
Synonyms:
N-{(3S,4R)-1-[N- cyclohexyl-6-(1,1- dioxidoisothiazolidin-2- yl)-D-norleucyl]-3- [(thiophen-2- ylmethyl)carbamoyl]pi- peridin-4-yl}-6- azaspiro[2.5]octane-6- carboxamide | US11014920, Compound 17
Type:
Small organic molecule
Emp. Form.:
C34H54N6O5S2
Mol. Mass.:
690.96
SMILES:
O=C(NCc1cccs1)[C@H]1CN(CC[C@H]1NC(=O)N1CCC2(CC2)CC1)C(=O)[C@@H](CCCCN1CCCS1(=O)=O)NC1CCCCC1
: