Target
Coagulation factor XII
Ligand
BDBM498917
Substrate
Meas. Tech.
Factor XIIa assay
IC50
5.00±n/a nM
Citation
 Hicks, JDMcKittrick, BAWhitehead, BRLombardo, MHan, XTaylor, JAChu, HDSo, SOrth, PWu, Z Factor XIIa inhibitors US Patent  US11014920 Publication Date 5/25/2021 
Target
Name:
Coagulation factor XII
Synonyms:
Beta-factor XIIa part 1 Carboxylesterase 2 (intestine, liver) Coagulation factor XII (FXII) Coagulation factor XIIa light chain FA12_HUMAN Factor XIIa (fXIIa) Hageman factor
Type:
Enzyme
Mol. Mass.:
67810.07
Organism:
Homo sapiens (Human)
Description:
P00748
Residue:
615
  
Inhibitor
Name:
BDBM498917
Synonyms:
(5R)-6-[(3S,4R)-4-[(6- azaspiro[2.5]oct-6- ylcarbonyl)amino]-3- (benzylcarbamoyl)pi- peridin-1-yl]-5- (cyclohexylamino)- N,N,N-trimethyl-6- oxohexan-1-aminium | US11014920, Compound 25
Type:
Small organic molecule
Emp. Form.:
C36H59N6O3
Mol. Mass.:
623.8915
SMILES:
C[N+](C)(C)CCCC[C@@H](NC1CCCCC1)C(=O)N1CC[C@@H](NC(=O)N2CCC3(CC3)CC2)[C@H](C1)C(=O)NCc1ccccc1
: